RDF description of biomass_characteristic_relation
primary topic: Charactéristiques de la biomasse

Charactéristiques de la biomasse
type: Class
type: Concept
subclass of: Relation
preferred label: Biomass Characteristic relation @en
scope note: Quand la biomasse ne possède pas d’amidon, on considère que le pourcentage de cellulose est égal au pourcentage de glucose et que le pourcentage d’hémicellulose est égal à la somme du taux de xylose et du taux d’arabinose. De plus, on considère que le taux de glucose est égal au taux de glucane divisé par 0.9.
scope note: When the biomass doesn’t have starch, we consider that the cellulose percentage equals to the glucose percentage and that the hemicellulose percentage equals to the sum of xylose and arabinose percentage. Furthermore, we consider that the glucose rate equals to glucan rate divided by 0.9. @en