Opération de séchage
type: Class
type: Concept
subclass of: Relation
preferred label: Drying solid quantity output relation @en
scope note: During treatments, we make the assumption that there is no waste of solid and liquid matter. Except for enzymatic hydrolysis of the solid waste is defined as the difference between the input biomass quantity and the quantity of extracted glucose. @en
scope note: Pendant les traitements, nous faisons l'hypothèse qu'il n'y a pas de perte de matière solide et liquide. Excepté pour l’hydrolyse enzymatique où le déchet de solide est défini par la différence entre la quantité de biomasse à l’entrée et la quantité extraite de glucose.

RDF description of drying_solid_quantity_output_relation
primary topic: Opération de séchage