Enzymatic hydrolysis relation
type: Class
type: Concept
subclass of: Relation
preferred label: Hydrolyse enzymatique @fr
scope note: To determinate the quantity of glucose after enzymatic hydrolysis, we made this calculation, biomass quantity of this step minus output solid quantity of this step.
scope note: To determine the “output solid quantity” in the process step of enzymatic hydrolysis, the biomass quantity of this step, the glucose yield of this step and the percentage of glucose or cellulose in the untreated biomass are required. The value output solid quantity is defined by the Biomass quantity of the step minus ((biomass quantity of the step x (glucose yield of the step divided by 100) x (percentage of glucose in untreated biomass divided by 100)).
scope note: Pour déterminer la quantité de glucose après hydrolyse enzymatique, nous faisons ce calcul, quantité de biomasse de l’étape moins quantité de solide en sortie de l’étape. @fr
scope note: Pour déterminer la “quantité de solide en sortie” dans l’étape d’hydrolyse enzymatique, la quantité de biomasse à l’entrée de l’étape, du taux de glucose à la sortie de l’étape et du pourcentage de glucose ou de cellulose de la biomasse non traité doivent être définies dans la publication. La quantité de solide en sortie est égale à la quantité de biomasse à l’entrée de l’étape –moins ((quantité de biomasse à l’entrée de l’étape x (taux de glucose à la sortie de l’étape divisé par 100) x (pourcentage de glucose dans la biomasse non traité divisé par 100)). @fr

RDF description of enzymatic_hydrolysis_relation
primary topic: Enzymatic hydrolysis relation