RDF description of milling_relation
primary topic: Milling relation

Milling relation
type: Class
type: Concept
subclass of: Relation
preferred label: Broyage ultra fin @fr
scope note: //www6.inra.fr/cati-icat-atweb/content/download/3153/32221/file/Table%20mesh%20in%20unit%20international.pdf">“Table mesh in unit international” .
scope note: During this step, the authors often express the particle size in Mesh. It is therefore necessary to convert the mesh in international units. For conversion table, look at the document <A HREF="http
scope note: Lors de cette étape, les auteurs expriment souvent la taille des particules en Mesh. Il faut donc convertir les mesh en unité internationale. Pour obtenir le tableau de conversion, regarder le document « Table mesh in unit international » @fr