livestock farming system
type: Class
subclass of: EOL_0000001
subset present: DuckPresent
subset present: GoatPresent
subset present: SeaBassPresent
subset present: QuailPresent
subset present: TilapiaPresent
subset present: SeaBreamPresent
subset present: ChickenPresent
subset present: SheepPresent
subset present: CarpPresent
subset present: CodPresent
subset present: TroutPresent
subset present: CattlePresent
subset present: SalmonPresent
subset present: PigPresent
subset present: HorsePresent
subset present: GoosePresent
subset present: ZebraFishPresent
subset present: TurkeyPresent
subset present: RabbitPresent
IAO_0000115: any characteristic related to the general description of farming system for aquaculture or terrestrial farming system

RDF description of livestock farming system
primary topic: livestock farming system