air pollutant
type: Class
subclass of: EOL_0000184
subset present: CattlePresent
IAO_0000115: any measurable or observable characteristic related to the introduction of chemicals, particulate matter, or biological materials that cause harm or discomfort to animal for livestock

RDF description of air pollutant
primary topic: air pollutant