RDF description of rearing aquatic zoocoenosis context
primary topic: rearing aquatic zoocoenosis context

rearing aquatic zoocoenosis context
type: Class
subclass of: EOL_0000045
subset absent: CattleAbsent
IAO_0000115: any characteristic related to the communities of animals present in the aquatic rearing system
has exact synonym: aquatic animal community support