RDF description of rearing terrestrial zoocoenosis context
primary topic: rearing terrestrial zoocoenosis context

rearing terrestrial zoocoenosis context
type: Class
subclass of: EOL_0000045
subset present: CattlePresent
IAO_0000115: any characteristic related to the communities of animals present in the terrestrial rearing system
has exact synonym: terrestrial animal community support