RDF description of aquaculture structure total volume
primary topic: aquaculture structure total volume

aquaculture structure total volume
type: Class
subclass of: EOL_0000297
subset absent: CattleAbsent
IAO_0000115: any characteristic used to define the total amount of 3D space of the aquatic rearing structure