RDF description of aquaculture structure water volume
primary topic: aquaculture structure water volume

aquaculture structure water volume
type: Class
subclass of: EOL_0000297
subset absent: CattleAbsent
IAO_0000115: any characteristic used to define the amount of 3D space occupied by the water in aquatic rearing structure