RDF description of aquaculture raceway
primary topic: aquaculture raceway

aquaculture raceway
type: Class
subclass of: EOL_0001531
subset absent: CattleAbsent
IAO_0000115: rectangular or trapezoidal structure through which flows a water current from one end (supply) to the other (evacuation), using for rearing aquatic animals
has exact synonym: raceway