aquaculture incubator
type: Class
subclass of: EOL_0000281
subset absent: CattleAbsent
IAO_0000115: aquaculture structure for incubating and hatching of eggs until larvae are produced
has exact synonym: egg incubator

RDF description of aquaculture incubator
primary topic: aquaculture incubator