fiberglass
type: Class
subclass of: EOL_0001957
hyperlink: http://www.ebi.ac.uk/chebi/searchId.do
subset absent: CattleAbsent
IAO_0000115: fiber reinforced polymer made of a plastic (most often polyester resin: CHEBI:60160) matrix renforced by fibers of glass
has exact synonym: GFK
has exact synonym: fiber-glass
has exact synonym: fibreglass

RDF description of fiberglass
primary topic: fiberglass