RDF description of pontoon
primary topic: pontoon

pontoon
type: Class
subclass of: EOL_0001957
subset present: CattlePresent
IAO_0000115: platform which supports cage structures and allows access to the rearing and kept afloat by means of floats of different types
has exact synonym: floating pontoon