net
type: Class
subclass of: EOL_0001957
subset absent: CattleAbsent
IAO_0000115: network of mesh to prevent passage of animals larger than the mesh width (EOL:0000301)
has exact synonym: net pen
has exact synonym: net cage

RDF description of net
primary topic: net