jar incubator
type: Class
subclass of: EOL_0001527
subset absent: CattleAbsent
IAO_0000115: cylindro-conical tanks or jars (zug jar, ...) with a system of upward stream of water to maintain gentle and even suspension of eggs

RDF description of jar incubator
primary topic: jar incubator