RDF description of vertical incubator
primary topic: vertical incubator

vertical incubator
type: Class
subclass of: EOL_0001527
subset absent: CattleAbsent
IAO_0000115: incubation system composed by a vertical stacking of several racks of horizontal shallow trays as incubators used for the hatching of fish egg