RDF description of horizontal incubator
primary topic: horizontal incubator

horizontal incubator
type: Class
subclass of: EOL_0001527
subset absent: CattleAbsent
IAO_0000115: incubation system horizontally oriented used for the hatching of fish egg
has exact synonym: breeding throughs
has exact synonym: horizontal throughs