RDF description of incubator box
primary topic: incubator box

incubator box
type: Class
subclass of: EOL_0001527
subset absent: CattleAbsent
IAO_0000115: a shallow box or tray set in the water (front flap against the current and cover a little above the water line) and anchored to the bottom for incubating eggs