RDF description of wild caught larval production system
primary topic: wild caught larval production system

wild caught larval production system
type: Class
subclass of: EOL_0001573
subset absent: CattleAbsent
IAO_0000115: system of production dedicated to the production of larvae and fry coming from the natural environment.This system may be composed of one or several rearing stage unit