RDF description of domesticated larval production system
primary topic: domesticated larval production system

domesticated larval production system
type: Class
subclass of: EOL_0001573
subset absent: CattleAbsent
IAO_0000115: system of production of larvae in a farm from a genitor born in a farm.This system may be composed of one or several rearing stage unit