RDF description of earth
primary topic: earth

earth
type: Class
subclass of: EOL_0001957
subset present: CattlePresent
IAO_0000115: solid matter found on land surface of the planet
has exact synonym: ground
has exact synonym: dry land