bedding
type: Class
subclass of: EOL_0001957
subset present: CattlePresent
IAO_0000115: ground cover material can be wood shavings, chopped straw or hay, rice husks, groundnut shells, shredded paper or other materials
has exact synonym: litter

RDF description of bedding
primary topic: bedding