duckboard
type: Class
subclass of: EOL_0001957
subset present: CattlePresent
IAO_0000115: flat slabs of wood or other material laid as a track or floor over wet or muddy ground allowing the elimination of manure
has exact synonym: slat

RDF description of duckboard
primary topic: duckboard