production unit structure
type: Class
subclass of: EOL_0000303
subset present: CattlePresent
IAO_0000115: any measurable or observable characteristic related to the form taken by the structure containing the livestock for one unit of production, e.g. cage, closed housing, ...

RDF description of production unit structure
primary topic: production unit structure