RDF description of ground management type
primary topic: ground management type

ground management type
type: Class
subclass of: EOL_0000303
subset present: CattlePresent
subset present: PigPresent
subset present: HorsePresent
subset present: DuckPresent
subset present: GoatPresent
subset present: QuailPresent
subset present: GoosePresent
subset present: ChickenPresent
subset present: TurkeyPresent
subset present: SheepPresent
subset present: RabbitPresent
IAO_0000115: equipment forming or covering the floor of the rearing structure