RDF description of group laying nest
primary topic: group laying nest

group laying nest
type: Class
subclass of: EOL_0001673
subset absent: CattleAbsent
IAO_0000115: structure for several laying hens not housed in batteries and used to collect eggs