vibert box
type: Class
subclass of: EOL_0001527
subset absent: CattleAbsent
IAO_0000115: a box in which fish eggs are placed prior to burial in gravel for the purposes of hatching. Hatching success is apparently less for eggs in the boxes than those buried directly in the gravel.
has exact synonym: fish incubator box

RDF description of vibert box
primary topic: vibert box