RDF description of diet relative composition
primary topic: diet relative composition

diet relative composition
type: Class
subclass of: EOL_0001684
subset present: CattlePresent
IAO_0000115: any measurable characteristic related to the relative composition of diet- e.g. 0.6 ground corn grain plus 0.4 sojbean meal
has exact synonym: relative composition of diet