RDF description of caviar production system
primary topic: caviar production system

caviar production system
type: Class
subclass of: EOL_0001572
subset absent: CattleAbsent
IAO_0000115: system dedicated to the production of fish mature oocytes whose purpose is for human consumption.This system may be composed of one or several rearing stage unit