rearing aquatic phytocoenosis context
type: Class
subclass of: EOL_0000044
subset absent: CattleAbsent
IAO_0000115: any characteristic related to the communities of plants present in the aquatic rearing system
has exact synonym: livestock aquatic phytocoenosis support

RDF description of rearing aquatic phytocoenosis context
primary topic: rearing aquatic phytocoenosis context