rearing terrestrial phytocoenosis context
type: Class
subclass of: EOL_0000044
subset present: CattlePresent
IAO_0000115: any characteristic related to the communities of plants present in the terrestrian rearing system

RDF description of rearing terrestrial phytocoenosis context
primary topic: rearing terrestrial phytocoenosis context