feed delivery
type: Class
subclass of: EOL_0001643
subset present: CattlePresent
IAO_0000115: any measurable or observable characteristic related to the delivery process of feed to livestock
has related synonym: overfeeding
has related synonym: starvation

RDF description of feed delivery
primary topic: feed delivery