soil chemical parameter
type: Class
subclass of: EOL_0000011
subset present: CattlePresent
IAO_0000115: any measurable or observable characteristic related to chemical parameters of the soil

RDF description of soil chemical parameter
primary topic: soil chemical parameter