soil physical parameter
type: Class
subclass of: EOL_0000011
subset present: CattlePresent
IAO_0000115: any measurable or observable characteristic related to physical parameters of soil

RDF description of soil physical parameter
primary topic: soil physical parameter