soil particule size
type: Class
subclass of: EOL_0001815
subset present: CattlePresent
IAO_0000115: any measurable or observable characteristic related to the diameter of individual grains of sediment, or the lithified particles in clastic rocks
has exact synonym: soil granulometry

RDF description of soil particule size
primary topic: soil particule size