soil plasticity
type: Class
subclass of: EOL_0001863
subset present: CattlePresent
IAO_0000115: the ability of soil to change shape, but not volume, continuously under the influence of a constant pressure and to retain the impressed shape when the pressure is removed

RDF description of soil plasticity
primary topic: soil plasticity