soil nitrate concentration
type: Class
subclass of: EOL_0001846
subset present: CattlePresent
IAO_0000115: proportion of nitrate (CHEBI:17632) content in a defined volume of soil

RDF description of soil nitrate concentration
primary topic: soil nitrate concentration