RDF description of soil nitrite concentration
primary topic: soil nitrite concentration

soil nitrite concentration
type: Class
subclass of: EOL_0001848
subset present: CattlePresent
IAO_0000115: proportion of nitrite (CHEBI:16301) content in a defined volume of soil