RDF description of soil ionized ammonia content
primary topic: soil ionized ammonia content

soil ionized ammonia content
type: Class
subclass of: EOL_0001850
subset present: CattlePresent
IAO_0000115: content of ionized form of ammonia in soil