soil un-ionized ammonia content
type: Class
subclass of: EOL_0001850
subset present: CattlePresent
IAO_0000115: content of un-ionized form of ammonia (NH3: CHEBI:16134) in soil

RDF description of soil un-ionized ammonia content
primary topic: soil un-ionized ammonia content