soil urea concentration
type: Class
subclass of: EOL_0001856
subset present: CattlePresent
IAO_0000115: proportion of urea (CHEBI:16199) content in a defined volume of soil

RDF description of soil urea concentration
primary topic: soil urea concentration