RDF description of soil color
primary topic: soil color

soil color
type: Class
subclass of: EOL_0001804
subset present: CattlePresent
IAO_0000115: any measurable or observable characteristic related to the color of soil