RDF description of rearing aquatic bacterial context
primary topic: rearing aquatic bacterial context

rearing aquatic bacterial context
type: Class
subclass of: EOL_0001825
subset absent: CattleAbsent
IAO_0000115: any characteristic related to the communities of bacteria present in the aquatic rearing system