rearing terrestrial bacterial context
type: Class
subclass of: EOL_0001825
subset present: CattlePresent
IAO_0000115: any characteristic related to the communities of bacteria present in the terrestrian rearing system

RDF description of rearing terrestrial bacterial context
primary topic: rearing terrestrial bacterial context