RDF description of capteur physiologique
primary topic: capteur physiologique

capteur physiologique
type: Class
subclass of: EOL_0001961
references: INRA:PHASE "INRA PHASE"
subset present: SolePresent
subset present: DuckPresent
subset present: GoatPresent
subset present: QuailPresent
subset present: SeaBassPresent
subset present: TilapiaPresent
subset present: SeaBreamPresent
subset present: ChickenPresent
subset present: SheepPresent
subset present: CarpPresent
subset present: TroutPresent
subset present: CodPresent
subset present: SalmonPresent
subset present: PigPresent
subset present: CattlePresent
subset present: HorsePresent
subset present: GoosePresent
subset present: ZebraFishPresent
subset present: TurkeyPresent
subset present: RabbitPresent
subset present: MousePresent
IAO_0000115: un dispositif électronique, externe ou interne, qui permet de mesurer et enregistrer des paramètres physiologiques de l'animal