RDF description of cage d'insémination artificielle
primary topic: cage d'insémination artificielle

cage d'insémination artificielle
type: Class
subclass of: EOL_0001979
references: INRA:PHASE "INRA PHASE"
subset absent: CodAbsent
subset absent: GooseAbsent
subset absent: TurkeyAbsent
subset absent: ChickenAbsent
subset absent: TroutAbsent
subset absent: CarpAbsent
subset absent: ZebraFishAbsent
subset absent: QuailAbsent
subset absent: SeaBassAbsent
subset absent: SoleAbsent
subset absent: SalmonAbsent
subset absent: DuckAbsent
subset absent: SeaBreamAbsent
subset absent: TilapiaAbsent
subset present: CattlePresent
IAO_0000115: une stalle ou une cage solide pour le bétail, spécialement conçue pour introduire le sperme dans le col de l'utérus ou la cavité utérine de la femme dans le but d'obtenir une grossesse par fécondation in vivo