RDF description of Enjeux
primary topic: Enjeux de l'agroécologie

Enjeux de l'agroécologie
type: Concept
type: NamedIndividual
definition: les attendus dans la mise en oeuvre d'une approche agroécologique
editorial note: AT-ARI
in scheme: MTEnjeux
in scheme: Thesaurus Agroecologie
narrower: attentes de la societe
narrower: reduction des intrants
narrower: adaptation des semences
narrower: intensification vegetale
narrower: durabilite des systemes agricoles
narrower: resistance des especes animales et vegetales
narrower: gestion des bioagresseurs
narrower: gestion durable des ressources
narrower: sante de l agroecosysteme
narrower: economie circulaire
narrower: valorisation des effluents
narrower: sante globale
narrower: resilience
narrower: sante des ecosystemes
narrower: sante animale
narrower: reduction du risque de pollution
narrower: sante des consommateurs
narrower: gestion integree de l eau
narrower: diversification des revenus
narrower: gestion du paysage et du territoire
narrower: independance des systemes agricoles
narrower: bien-etre animal
narrower: valorisation des interactions biologiques
narrower: gestion du parasitisme
narrower: changement climatique
narrower: performance des sytemes agricoles
top concept of: MTEnjeux
top concept of: Thesaurus Agroecologie