RDF description of agroforesterie
primary topic: agroforesterie

agroforesterie
type: Concept
type: NamedIndividual
alternative label: agro-foresterie
broader: Systemes
definition: Au sens large, l’agroforesterie englobe les systèmes de production intégrant aussi bien les arbres dans les pratiques et les espaces agricoles, que les productions agricoles dans les pratiques forestières et les espaces arborés.... [Dictionnaire d'agroécologie : https://dicoagroecologie.fr/encyclopedie/agroforesterie/]
editorial note: AT-ARI
in scheme: MTSystemes
in scheme: Thesaurus Agroecologie
narrower: produit agroforestier