RDF description of alimentation_durable
primary topic: alimentation durable

alimentation durable
type: Concept
type: NamedIndividual
alternative label: alimentation durable des animaux d'élevage
broader: alimentation animale
definition: L’alimentation durable des animaux d’élevage a comme finalité d’apporter des éléments nutritionnels, via des matières premières d’origine végétale constituant tout ou partie de la ration, de façon à répondre à : leurs besoins nutritionnels à savoir l’entretien, la croissance, la reproduction et les productions, leur santé ainsi que leurs comportements spécifiques, tout en s’inscrivant dans le cadre du développement durable... [Dictionnaire d'agroécologie : https://dicoagroecologie.fr/encyclopedie/alimentation-durable-des-animaux-delevage/]
in scheme: Thesaurus Agroecologie
in scheme: MTLeviers